{"text_format":"1","workbook":"xlsx","n_sheets":3,"sheets":["Worksheet","Choices","CPI"],"not_rendered":{"charts":0,"images":0,"macros":1,"external_links":0,"defined_names":29,"comments":1,"pivot_tables":0},"unopened":[],"bounds":{"document_bytes":16777216,"sheet_cells":100000,"rows_first":2000,"rows_last":500,"rows_between":2000,"halvings":0,"cell_chars":16384,"cell_head_chars":4096},"cells_cut":0,"cells_raw":0,"read":"whole","date_system":"1900"}

{"sheet":"Worksheet","index":0,"n_rows":98,"n_cols":22,"rows_kept":98,"cut":false,"hidden":false,"merged":[[18,6,18,8],[5,4,5,7],[18,3,18,5],[18,9,18,12],[7,5,7,7],[0,15,0,17],[1,15,1,17],[18,13,18,15],[18,16,18,17],[0,9,0,10],[0,11,0,13],[1,11,1,13],[6,9,11,10],[4,9,5,9],[12,9,14,10]]}
[null,null,null,"CGT on Sale of Identical Shares",null,null,null,null,null,null,null,null,null,null,null,"Client Name"]
[null,null,null,"Year Ended 30 June 2016",null,null,null,null,null,null,null,null,null,null,null,"Preparer Name"]
[]
[]
[null,null,null,null,null,null,null,null,null,"IMPORTANT",null,null,"Summary",null,"Indexation","Discount","Other","Total"]
[null,null,null,"Company",null,null,null,null,null,null,null,null,"Quantity Sold",null,{"$f":"Choices!O90","v":0},{"$f":"Choices!S90","v":0},{"$f":"R6-O6-P6","v":0},{"$f":"Sold","v":0},null,null,null,{"$f":"E10","v":0}]
[null,null,null,null,null,null,null,null,1,"From 8 May 2012, foreign or temporary resident individuals must meet certain eligibility conditions to apply the CGT discount.  These calculations assume that the full discount can be claimed.",null,null,"Capital Proceeds",null,{"$f":"SUMPRODUCT(Choices!K15:K89,Choices!O15:O89)","v":0},{"$f":"SUMPRODUCT(Choices!K15:K89,Choices!S15:S89)","v":0},{"$f":"SUMIF(P21:P95,\"<>0\",K21:K95)","v":0},{"$f":"SUM(O7:Q7)","v":0}]
[null,null,null,"Date Sold",null,{"$f":"IF(OR(F10>0,F9>0),\"Reconcile Quantities in Table Below\",IF(Sold>E10,\"Disposals in Table Exceed Quantity Sold\",\"\"))","v":""},null,null,null,null,null,null,"Less Cost Base",null,{"$f":"SUMPRODUCT(Choices!L15:L89,Choices!O15:O89)","v":0},{"$f":"SUMPRODUCT(Choices!P15:P89,Choices!S15:S89)","v":0},{"$f":"SUMIF(P21:P95,\"<>0\",L21:L95)","v":0},{"$f":"SUM(O8:Q8)","v":0}]
[null,null,null,"Proceeds",null,{"$f":"IF(E10>Acquired,E10-Acquired,0)","v":0},{"$f":"IF(Acquired<E10,\"acquisitions still to be shown\",\"\")","v":""},null,null,null,null,null,"Total Capital Gain/(Loss)",null,{"$f":"O7-O8","v":0},{"$f":"P7-P8","v":0},{"$f":"Q7-Q8","v":0},{"$f":"SUM(O9:Q9)","v":0},null,null,null,{"$f":"SUM(N96:P96)","v":0}]
[null,null,null,"Quantity Sold",null,{"$f":"IF(E10>Sold,E10-Sold,0)","v":0},{"$f":"IF(Sold<E10,\"disposals still to be selected\",\"\")","v":""},null,null,null,null,null,"Offset Any Losses",null,{"$f":"IF(Q9<0,MAX(-O9,Q9),0)","v":0},{"$f":"IF(Q9<0,MAX(-P9,Q9-O10),0)","v":0},{"$f":"-O10-P10","v":0},{"$f":"SUM(O10:Q10)","v":0}]
[null,null,null,null,null,null,null,null,null,null,null,null,null,null,{"$f":"IF(O9<>\"                 Error\",O9+O10,0)","v":0},{"$f":"IF(P9<>\"                 Error\",P9+P10,0)","v":0},{"$f":"IF(Q9<>\"                 Error\",Q9+Q10,0)","v":0},{"$f":"R9+R10","v":0}]
[null,null,null,"Capital Losses",null,"Current Year","Prior Year","Total",null,null,null,null,"Less Current Year Losses",null,{"$f":"IF(O11>0,MIN(O11,F13,F13-Q12),0)","v":0},{"$f":"IF(P11>0,MIN(P11,F13-O12-Q12),0)","v":0},{"$f":"IF(AND(F13>0,Q11>0),MIN(Q11,F13),0)","v":0},{"$f":"SUM(O12:Q12)","v":0}]
[null,null,null,"Other Losses Available",null,null,null,{"$f":"SUM(F13:G13)","v":0},2,"Do no leave blank rows when entering data below.  To remove blank rows and sort the table in date order, click this button.",null,null,null,null,{"$f":"O11-O12","v":0},{"$f":"P11-P12","v":0},{"$f":"IF(Q11>0,Q11-Q12,Q11)","v":0},{"$f":"R11-R12","v":0}]
[null,null,null,"Less Losses Recouped",null,{"$f":"SUM(O12:Q12)","v":0},{"$f":"SUM(O14:Q14)","v":0},{"$f":"SUM(F14:G14)","v":0},null,null,null,null,"Less Prior Year Losses",null,{"$f":"IF(O13>0,MIN(O13,G13-Q14),0)","v":0},{"$f":"IF(P13>0,MIN(P13,G13-O14-Q14),0)","v":0},{"$f":"IF(AND(G13>0,Q13>0),MIN(Q13,G13),0)","v":0},{"$f":"SUM(O14:Q14)","v":0}]
[null,null,null,"Sub-Total",null,null,null,{"$f":"H13-H14","v":0},null,null,null,null,null,null,{"$f":"O13-O14","v":0},{"$f":"P13-P14","v":0},{"$f":"IF(Q13>0,Q13-Q14,Q13)","v":0},{"$f":"R13-R14","v":0}]
[null,null,null,"Add Any Losses on These Shares",null,null,null,{"$f":"IF(R17<0,-R17,0)","v":0},null,null,null,null,"Less CGT Discount",null,null,{"$f":"P15/2","v":0},null,{"$f":"SUM(O16:Q16)","v":0}]
[null,null,null,"Net Capital Losses Carried Forward to Later Years",null,null,null,{"$f":"H15+H16","v":0},null,null,null,null,"Net Capital Gain/(Loss)",null,{"$f":"O15","v":0},{"$f":"P15-P16","v":0},{"$f":"Q15","v":0},{"$f":"R15-R16","v":0}]
[]
[null,null,null,"Acquisitions",null,null,"Cost Base Per Share",null,null,"Disposals",null,null,null,"Capital Gains/(Losses)",null,null,"Shares Remaining"]
[null,null,null,"Date","Quantity","Total Cost","Cost","Return of Cap","Cost Base","Quantity","Proceeds","Cost","Indexed Cost","Indexation","Discount","Other","Quantity","Cost"]
[null,null,1,null,null,null,{"$f":"IF(E21>0,F21/E21,0)","v":0},null,{"$f":"G21-H21","v":0},null,{"$f":"IF($E$10>0,$E$9/$E$10*J21,0)","v":0},{"$f":"J21*I21","v":0},{"$f":"IF(AND(D21>0,D21<CpiDate,L21>0),L21*CPI!$F$67/VLOOKUP(Worksheet!D21,Cpi,3,TRUE),0)","v":0},{"$f":"Choices!N15","v":0},{"$f":"Choices!R15","v":0},{"$f":"IF(AND(J21>0,OR(K21<L21,$E$8-D21+1<365)),K21-L21,0)","v":0},{"$f":"E21-J21","v":0},{"$f":"IF(E21>0,(Q21*F21/E21)-(Q21*H21),0)","v":0}]
[null,null,{"$f":"C21+1","v":2},null,null,null,0,null,0,null,{"$f":"IF($E$10>0,$E$9/$E$10*J22,0)","v":0},{"$f":"J22*I22","v":0},{"$f":"IF(AND(D22>0,D22<CpiDate,L22>0),L22*CPI!$F$67/VLOOKUP(Worksheet!D22,Cpi,3,TRUE),0)","v":0},{"$f":"Choices!N16","v":0},{"$f":"Choices!R16","v":0},0,0,{"$f":"IF(E22>0,(Q22*F22/E22)-(Q22*H22),0)","v":0},null,null,null,{"$f":"IF(OR(D22>0,E22>0,F22>0,J22>0),0,\"Blank\")","v":"Blank"}]
[null,null,{"$f":"C22+1","v":3},null,null,null,0,null,0,null,0,0,{"$f":"IF(AND(D23>0,D23<CpiDate,L23>0),L23*CPI!$F$67/VLOOKUP(Worksheet!D23,Cpi,3,TRUE),0)","v":0},{"$f":"Choices!N17","v":0},{"$f":"Choices!R17","v":0},0,0,0,null,null,null,"Blank"]
[null,null,4,null,null,null,0,null,0,null,0,0,{"$f":"IF(AND(D24>0,D24<CpiDate,L24>0),L24*CPI!$F$67/VLOOKUP(Worksheet!D24,Cpi,3,TRUE),0)","v":0},{"$f":"Choices!N18","v":0},{"$f":"Choices!R18","v":0},0,0,0,null,null,null,"Blank"]
[null,null,5,null,null,null,0,null,0,null,0,0,{"$f":"IF(AND(D25>0,D25<CpiDate,L25>0),L25*CPI!$F$67/VLOOKUP(Worksheet!D25,Cpi,3,TRUE),0)","v":0},{"$f":"Choices!N19","v":0},{"$f":"Choices!R19","v":0},0,0,0,null,null,null,"Blank"]
[null,null,6,null,null,null,0,null,0,null,0,0,{"$f":"IF(AND(D26>0,D26<CpiDate,L26>0),L26*CPI!$F$67/VLOOKUP(Worksheet!D26,Cpi,3,TRUE),0)","v":0},{"$f":"Choices!N20","v":0},{"$f":"Choices!R20","v":0},0,0,0,null,null,null,"Blank"]
[null,null,7,null,null,null,0,null,0,null,0,0,{"$f":"IF(AND(D27>0,D27<CpiDate,L27>0),L27*CPI!$F$67/VLOOKUP(Worksheet!D27,Cpi,3,TRUE),0)","v":0},{"$f":"Choices!N21","v":0},{"$f":"Choices!R21","v":0},0,0,0,null,null,null,"Blank"]
[null,null,8,null,null,null,0,null,0,null,0,0,{"$f":"IF(AND(D28>0,D28<CpiDate,L28>0),L28*CPI!$F$67/VLOOKUP(Worksheet!D28,Cpi,3,TRUE),0)","v":0},{"$f":"Choices!N22","v":0},{"$f":"Choices!R22","v":0},0,0,0,null,null,null,"Blank"]
[null,null,9,null,null,null,0,null,0,null,0,0,{"$f":"IF(AND(D29>0,D29<CpiDate,L29>0),L29*CPI!$F$67/VLOOKUP(Worksheet!D29,Cpi,3,TRUE),0)","v":0},{"$f":"Choices!N23","v":0},{"$f":"Choices!R23","v":0},0,0,0,null,null,null,"Blank"]
[null,null,10,null,null,null,0,null,0,null,0,0,{"$f":"IF(AND(D30>0,D30<CpiDate,L30>0),L30*CPI!$F$67/VLOOKUP(Worksheet!D30,Cpi,3,TRUE),0)","v":0},{"$f":"Choices!N24","v":0},{"$f":"Choices!R24","v":0},0,0,0,null,null,null,"Blank"]
{"$rows_left_out":69}
{"sheet":"Choices","index":1,"n_rows":91,"n_cols":23,"rows_kept":91,"cut":false,"hidden":false,"merged":[[0,11,0,12],[0,13,0,14],[0,16,0,18],[1,13,1,14],[1,16,1,18],[5,10,10,10],[5,3,6,5],[5,11,10,18],[12,3,12,5],[12,6,12,7],[12,8,12,9],[12,11,12,14],[12,15,12,18]]}
[null,null,null,"CGT on Sale of Identical Shares - Choice of Method Report",null,null,null,null,null,null,null,null,null,null,null,null,{"$f":"Worksheet!P1","v":"Client Name"},null,null,null,null,null,"HIDE"]
[null,null,null,{"$f":"Worksheet!D2","v":"Year Ended 30 June 2016"},null,null,null,null,null,null,null,null,null,null,null,null,{"$f":"Worksheet!P2","v":"Preparer Name"}]
[]
[]
[]
[null,null,null,"Choice of Method Report",null,null,null,null,null,null,"CHOICE","Order of Deducting Capital Losess\nCapital losses are deducted firstly from capital gains made within 12 months, then from gains using the indexation method and lastly from discounted capital gains.\n\nChoice of Indexation or Discount Methods\nAfter all capital losses have been accounted for, the worksheet will then choose either the Indexation Method or Discount Method depending on which method gives the greater benefit (lower gain). "]
[]
[]
[]
[]
[]
[]
[null,null,null,"Capital Losses to Absorb Indexation",null,null,"Share Details",null,"Methods Available",null,"Proceeds","Indexation Method",null,null,null,"Discount Method"]
[null,null,null,"B/F","Used","C/F","Date Acq","Qty Sold","Indexation","Discount","Per Share","Cost/Share","Gain/Share","Cap Gain","Qty","Cost/Share","Gain/Share","Cap Gain","Qty"]
[null,null,null,{"$f":"Worksheet!H13+IF(Worksheet!Q9<0,-Worksheet!Q9,0)","v":0},{"$f":"IF(D15>0,MIN(D15,N15),0)","v":0},{"$f":"D15-E15","v":0},{"$f":"Worksheet!D21","v":"00:00:00"},{"$f":"Worksheet!J21","v":0},{"$f":"IF(AND(Worksheet!D21>0,Worksheet!D21<CpiDate,Worksheet!K21>Worksheet!M21,Worksheet!$E$8-Worksheet!D21+1>365),\"Yes\",IF(Worksheet!D21>0,\"No\",\"\"))","v":""},{"$f":"IF(AND(Worksheet!D21>0,Worksheet!$E$8-Worksheet!D21+1>365,Worksheet!K21>Worksheet!L21),\"Yes\",IF(Worksheet!D21>0,\"No\",\"\"))","v":""},{"$f":"IF(Worksheet!J21>0,Worksheet!K21/Worksheet!J21,0)","v":0},{"$f":"IF(AND(I15=\"Yes\",Worksheet!J21>0),Worksheet!M21/Worksheet!J21,0)","v":0},{"$f":"IF(I15=\"Yes\",K15-L15,0)","v":0},{"$f":"IF(AND(I15=\"Yes\",M15<Q15/2),M15*H15,IF(AND(I15=\"Yes\",D15>0),MIN(D15,M15*H15),0))","v":0},{"$f":"IF(M15>0,N15/M15,0)","v":0},{"$f":"IF(AND(J15=\"Yes\",Worksheet!E21>0),(Worksheet!F21/Worksheet!E21)-Worksheet!H21,0)","v":0},{"$f":"IF(J15=\"Yes\",K15-P15,0)","v":0},{"$f":"S15*Q15","v":0},{"$f":"IF(J15=\"Yes\",H15-O15,0)","v":0}]
[null,null,null,{"$f":"IF(H16>0,F15,0)","v":0},{"$f":"IF(D16>0,MIN(D16,N16),0)","v":0},{"$f":"D16-E16","v":0},{"$f":"Worksheet!D22","v":"00:00:00"},{"$f":"Worksheet!J22","v":0},{"$f":"IF(AND(Worksheet!D22>0,Worksheet!D22<CpiDate,Worksheet!K22>Worksheet!M22,Worksheet!$E$8-Worksheet!D22+1>365),\"Yes\",IF(Worksheet!D22>0,\"No\",\"\"))","v":""},{"$f":"IF(AND(Worksheet!D22>0,Worksheet!$E$8-Worksheet!D22+1>365,Worksheet!K22>Worksheet!L22),\"Yes\",IF(Worksheet!D22>0,\"No\",\"\"))","v":""},{"$f":"IF(Worksheet!J22>0,Worksheet!K22/Worksheet!J22,0)","v":0},{"$f":"IF(AND(I16=\"Yes\",Worksheet!J22>0),Worksheet!M22/Worksheet!J22,0)","v":0},{"$f":"IF(I16=\"Yes\",K16-L16,0)","v":0},{"$f":"IF(AND(I16=\"Yes\",M16<Q16/2),M16*H16,IF(AND(I16=\"Yes\",D16>0),MIN(D16,M16*H16),0))","v":0},{"$f":"IF(M16>0,N16/M16,0)","v":0},{"$f":"IF(AND(J16=\"Yes\",Worksheet!E22>0),(Worksheet!F22/Worksheet!E22)-Worksheet!H22,0)","v":0},{"$f":"IF(J16=\"Yes\",K16-P16,0)","v":0},{"$f":"S16*Q16","v":0},{"$f":"IF(J16=\"Yes\",H16-O16,0)","v":0},null,null,null,{"$f":"IF(OR(G16>0,H16>0),0,\"Blank\")","v":"Blank"}]
[null,null,null,{"$f":"IF(H17>0,F16,0)","v":0},0,0,{"$f":"Worksheet!D23","v":"00:00:00"},{"$f":"Worksheet!J23","v":0},{"$f":"IF(AND(Worksheet!D23>0,Worksheet!D23<CpiDate,Worksheet!K23>Worksheet!M23,Worksheet!$E$8-Worksheet!D23+1>365),\"Yes\",IF(Worksheet!D23>0,\"No\",\"\"))","v":""},{"$f":"IF(AND(Worksheet!D23>0,Worksheet!$E$8-Worksheet!D23+1>365,Worksheet!K23>Worksheet!L23),\"Yes\",IF(Worksheet!D23>0,\"No\",\"\"))","v":""},{"$f":"IF(Worksheet!J23>0,Worksheet!K23/Worksheet!J23,0)","v":0},{"$f":"IF(AND(I17=\"Yes\",Worksheet!J23>0),Worksheet!M23/Worksheet!J23,0)","v":0},0,0,0,{"$f":"IF(AND(J17=\"Yes\",Worksheet!E23>0),(Worksheet!F23/Worksheet!E23)-Worksheet!H23,0)","v":0},0,0,0,null,null,null,{"$f":"IF(OR(G17>0,H17>0),0,\"Blank\")","v":"Blank"}]
[null,null,null,0,0,0,{"$f":"Worksheet!D24","v":"00:00:00"},{"$f":"Worksheet!J24","v":0},{"$f":"IF(AND(Worksheet!D24>0,Worksheet!D24<CpiDate,Worksheet!K24>Worksheet!M24,Worksheet!$E$8-Worksheet!D24+1>365),\"Yes\",IF(Worksheet!D24>0,\"No\",\"\"))","v":""},{"$f":"IF(AND(Worksheet!D24>0,Worksheet!$E$8-Worksheet!D24+1>365,Worksheet!K24>Worksheet!L24),\"Yes\",IF(Worksheet!D24>0,\"No\",\"\"))","v":""},{"$f":"IF(Worksheet!J24>0,Worksheet!K24/Worksheet!J24,0)","v":0},{"$f":"IF(AND(I18=\"Yes\",Worksheet!J24>0),Worksheet!M24/Worksheet!J24,0)","v":0},0,0,0,{"$f":"IF(AND(J18=\"Yes\",Worksheet!E24>0),(Worksheet!F24/Worksheet!E24)-Worksheet!H24,0)","v":0},0,0,0,null,null,null,"Blank"]
[null,null,null,0,0,0,{"$f":"Worksheet!D25","v":"00:00:00"},{"$f":"Worksheet!J25","v":0},{"$f":"IF(AND(Worksheet!D25>0,Worksheet!D25<CpiDate,Worksheet!K25>Worksheet!M25,Worksheet!$E$8-Worksheet!D25+1>365),\"Yes\",IF(Worksheet!D25>0,\"No\",\"\"))","v":""},{"$f":"IF(AND(Worksheet!D25>0,Worksheet!$E$8-Worksheet!D25+1>365,Worksheet!K25>Worksheet!L25),\"Yes\",IF(Worksheet!D25>0,\"No\",\"\"))","v":""},{"$f":"IF(Worksheet!J25>0,Worksheet!K25/Worksheet!J25,0)","v":0},{"$f":"IF(AND(I19=\"Yes\",Worksheet!J25>0),Worksheet!M25/Worksheet!J25,0)","v":0},0,0,0,{"$f":"IF(AND(J19=\"Yes\",Worksheet!E25>0),(Worksheet!F25/Worksheet!E25)-Worksheet!H25,0)","v":0},0,0,0,null,null,null,"Blank"]
[null,null,null,0,0,0,{"$f":"Worksheet!D26","v":"00:00:00"},{"$f":"Worksheet!J26","v":0},{"$f":"IF(AND(Worksheet!D26>0,Worksheet!D26<CpiDate,Worksheet!K26>Worksheet!M26,Worksheet!$E$8-Worksheet!D26+1>365),\"Yes\",IF(Worksheet!D26>0,\"No\",\"\"))","v":""},{"$f":"IF(AND(Worksheet!D26>0,Worksheet!$E$8-Worksheet!D26+1>365,Worksheet!K26>Worksheet!L26),\"Yes\",IF(Worksheet!D26>0,\"No\",\"\"))","v":""},{"$f":"IF(Worksheet!J26>0,Worksheet!K26/Worksheet!J26,0)","v":0},{"$f":"IF(AND(I20=\"Yes\",Worksheet!J26>0),Worksheet!M26/Worksheet!J26,0)","v":0},0,0,0,{"$f":"IF(AND(J20=\"Yes\",Worksheet!E26>0),(Worksheet!F26/Worksheet!E26)-Worksheet!H26,0)","v":0},0,0,0,null,null,null,"Blank"]
[null,null,null,0,0,0,{"$f":"Worksheet!D27","v":"00:00:00"},{"$f":"Worksheet!J27","v":0},{"$f":"IF(AND(Worksheet!D27>0,Worksheet!D27<CpiDate,Worksheet!K27>Worksheet!M27,Worksheet!$E$8-Worksheet!D27+1>365),\"Yes\",IF(Worksheet!D27>0,\"No\",\"\"))","v":""},{"$f":"IF(AND(Worksheet!D27>0,Worksheet!$E$8-Worksheet!D27+1>365,Worksheet!K27>Worksheet!L27),\"Yes\",IF(Worksheet!D27>0,\"No\",\"\"))","v":""},{"$f":"IF(Worksheet!J27>0,Worksheet!K27/Worksheet!J27,0)","v":0},{"$f":"IF(AND(I21=\"Yes\",Worksheet!J27>0),Worksheet!M27/Worksheet!J27,0)","v":0},0,0,0,{"$f":"IF(AND(J21=\"Yes\",Worksheet!E27>0),(Worksheet!F27/Worksheet!E27)-Worksheet!H27,0)","v":0},0,0,0,null,null,null,"Blank"]
[null,null,null,0,0,0,{"$f":"Worksheet!D28","v":"00:00:00"},{"$f":"Worksheet!J28","v":0},{"$f":"IF(AND(Worksheet!D28>0,Worksheet!D28<CpiDate,Worksheet!K28>Worksheet!M28,Worksheet!$E$8-Worksheet!D28+1>365),\"Yes\",IF(Worksheet!D28>0,\"No\",\"\"))","v":""},{"$f":"IF(AND(Worksheet!D28>0,Worksheet!$E$8-Worksheet!D28+1>365,Worksheet!K28>Worksheet!L28),\"Yes\",IF(Worksheet!D28>0,\"No\",\"\"))","v":""},{"$f":"IF(Worksheet!J28>0,Worksheet!K28/Worksheet!J28,0)","v":0},{"$f":"IF(AND(I22=\"Yes\",Worksheet!J28>0),Worksheet!M28/Worksheet!J28,0)","v":0},0,0,0,{"$f":"IF(AND(J22=\"Yes\",Worksheet!E28>0),(Worksheet!F28/Worksheet!E28)-Worksheet!H28,0)","v":0},0,0,0,null,null,null,"Blank"]
[null,null,null,0,0,0,{"$f":"Worksheet!D29","v":"00:00:00"},{"$f":"Worksheet!J29","v":0},{"$f":"IF(AND(Worksheet!D29>0,Worksheet!D29<CpiDate,Worksheet!K29>Worksheet!M29,Worksheet!$E$8-Worksheet!D29+1>365),\"Yes\",IF(Worksheet!D29>0,\"No\",\"\"))","v":""},{"$f":"IF(AND(Worksheet!D29>0,Worksheet!$E$8-Worksheet!D29+1>365,Worksheet!K29>Worksheet!L29),\"Yes\",IF(Worksheet!D29>0,\"No\",\"\"))","v":""},{"$f":"IF(Worksheet!J29>0,Worksheet!K29/Worksheet!J29,0)","v":0},{"$f":"IF(AND(I23=\"Yes\",Worksheet!J29>0),Worksheet!M29/Worksheet!J29,0)","v":0},0,0,0,{"$f":"IF(AND(J23=\"Yes\",Worksheet!E29>0),(Worksheet!F29/Worksheet!E29)-Worksheet!H29,0)","v":0},0,0,0,null,null,null,"Blank"]
[null,null,null,0,0,0,{"$f":"Worksheet!D30","v":"00:00:00"},{"$f":"Worksheet!J30","v":0},{"$f":"IF(AND(Worksheet!D30>0,Worksheet!D30<CpiDate,Worksheet!K30>Worksheet!M30,Worksheet!$E$8-Worksheet!D30+1>365),\"Yes\",IF(Worksheet!D30>0,\"No\",\"\"))","v":""},{"$f":"IF(AND(Worksheet!D30>0,Worksheet!$E$8-Worksheet!D30+1>365,Worksheet!K30>Worksheet!L30),\"Yes\",IF(Worksheet!D30>0,\"No\",\"\"))","v":""},{"$f":"IF(Worksheet!J30>0,Worksheet!K30/Worksheet!J30,0)","v":0},{"$f":"IF(AND(I24=\"Yes\",Worksheet!J30>0),Worksheet!M30/Worksheet!J30,0)","v":0},0,0,0,{"$f":"IF(AND(J24=\"Yes\",Worksheet!E30>0),(Worksheet!F30/Worksheet!E30)-Worksheet!H30,0)","v":0},0,0,0,null,null,null,"Blank"]
[null,null,null,0,0,0,{"$f":"Worksheet!D31","v":"00:00:00"},{"$f":"Worksheet!J31","v":0},{"$f":"IF(AND(Worksheet!D31>0,Worksheet!D31<CpiDate,Worksheet!K31>Worksheet!M31,Worksheet!$E$8-Worksheet!D31+1>365),\"Yes\",IF(Worksheet!D31>0,\"No\",\"\"))","v":""},{"$f":"IF(AND(Worksheet!D31>0,Worksheet!$E$8-Worksheet!D31+1>365,Worksheet!K31>Worksheet!L31),\"Yes\",IF(Worksheet!D31>0,\"No\",\"\"))","v":""},{"$f":"IF(Worksheet!J31>0,Worksheet!K31/Worksheet!J31,0)","v":0},{"$f":"IF(AND(I25=\"Yes\",Worksheet!J31>0),Worksheet!M31/Worksheet!J31,0)","v":0},0,0,0,{"$f":"IF(AND(J25=\"Yes\",Worksheet!E31>0),(Worksheet!F31/Worksheet!E31)-Worksheet!H31,0)","v":0},0,0,0,null,null,null,"Blank"]
[null,null,null,0,0,0,{"$f":"Worksheet!D32","v":"00:00:00"},{"$f":"Worksheet!J32","v":0},{"$f":"IF(AND(Worksheet!D32>0,Worksheet!D32<CpiDate,Worksheet!K32>Worksheet!M32,Worksheet!$E$8-Worksheet!D32+1>365),\"Yes\",IF(Worksheet!D32>0,\"No\",\"\"))","v":""},{"$f":"IF(AND(Worksheet!D32>0,Worksheet!$E$8-Worksheet!D32+1>365,Worksheet!K32>Worksheet!L32),\"Yes\",IF(Worksheet!D32>0,\"No\",\"\"))","v":""},{"$f":"IF(Worksheet!J32>0,Worksheet!K32/Worksheet!J32,0)","v":0},{"$f":"IF(AND(I26=\"Yes\",Worksheet!J32>0),Worksheet!M32/Worksheet!J32,0)","v":0},0,0,0,{"$f":"IF(AND(J26=\"Yes\",Worksheet!E32>0),(Worksheet!F32/Worksheet!E32)-Worksheet!H32,0)","v":0},0,0,0,null,null,null,"Blank"]
[null,null,null,0,0,0,{"$f":"Worksheet!D33","v":"00:00:00"},{"$f":"Worksheet!J33","v":0},{"$f":"IF(AND(Worksheet!D33>0,Worksheet!D33<CpiDate,Worksheet!K33>Worksheet!M33,Worksheet!$E$8-Worksheet!D33+1>365),\"Yes\",IF(Worksheet!D33>0,\"No\",\"\"))","v":""},{"$f":"IF(AND(Worksheet!D33>0,Worksheet!$E$8-Worksheet!D33+1>365,Worksheet!K33>Worksheet!L33),\"Yes\",IF(Worksheet!D33>0,\"No\",\"\"))","v":""},{"$f":"IF(Worksheet!J33>0,Worksheet!K33/Worksheet!J33,0)","v":0},{"$f":"IF(AND(I27=\"Yes\",Worksheet!J33>0),Worksheet!M33/Worksheet!J33,0)","v":0},0,0,0,{"$f":"IF(AND(J27=\"Yes\",Worksheet!E33>0),(Worksheet!F33/Worksheet!E33)-Worksheet!H33,0)","v":0},0,0,0,null,null,null,"Blank"]
[null,null,null,0,0,0,{"$f":"Worksheet!D34","v":"00:00:00"},{"$f":"Worksheet!J34","v":0},{"$f":"IF(AND(Worksheet!D34>0,Worksheet!D34<CpiDate,Worksheet!K34>Worksheet!M34,Worksheet!$E$8-Worksheet!D34+1>365),\"Yes\",IF(Worksheet!D34>0,\"No\",\"\"))","v":""},{"$f":"IF(AND(Worksheet!D34>0,Worksheet!$E$8-Worksheet!D34+1>365,Worksheet!K34>Worksheet!L34),\"Yes\",IF(Worksheet!D34>0,\"No\",\"\"))","v":""},{"$f":"IF(Worksheet!J34>0,Worksheet!K34/Worksheet!J34,0)","v":0},{"$f":"IF(AND(I28=\"Yes\",Worksheet!J34>0),Worksheet!M34/Worksheet!J34,0)","v":0},0,0,0,{"$f":"IF(AND(J28=\"Yes\",Worksheet!E34>0),(Worksheet!F34/Worksheet!E34)-Worksheet!H34,0)","v":0},0,0,0,null,null,null,"Blank"]
[null,null,null,0,0,0,{"$f":"Worksheet!D35","v":"00:00:00"},{"$f":"Worksheet!J35","v":0},{"$f":"IF(AND(Worksheet!D35>0,Worksheet!D35<CpiDate,Worksheet!K35>Worksheet!M35,Worksheet!$E$8-Worksheet!D35+1>365),\"Yes\",IF(Worksheet!D35>0,\"No\",\"\"))","v":""},{"$f":"IF(AND(Worksheet!D35>0,Worksheet!$E$8-Worksheet!D35+1>365,Worksheet!K35>Worksheet!L35),\"Yes\",IF(Worksheet!D35>0,\"No\",\"\"))","v":""},{"$f":"IF(Worksheet!J35>0,Worksheet!K35/Worksheet!J35,0)","v":0},{"$f":"IF(AND(I29=\"Yes\",Worksheet!J35>0),Worksheet!M35/Worksheet!J35,0)","v":0},0,0,0,{"$f":"IF(AND(J29=\"Yes\",Worksheet!E35>0),(Worksheet!F35/Worksheet!E35)-Worksheet!H35,0)","v":0},0,0,0,null,null,null,"Blank"]
[null,null,null,0,0,0,{"$f":"Worksheet!D36","v":"00:00:00"},{"$f":"Worksheet!J36","v":0},{"$f":"IF(AND(Worksheet!D36>0,Worksheet!D36<CpiDate,Worksheet!K36>Worksheet!M36,Worksheet!$E$8-Worksheet!D36+1>365),\"Yes\",IF(Worksheet!D36>0,\"No\",\"\"))","v":""},{"$f":"IF(AND(Worksheet!D36>0,Worksheet!$E$8-Worksheet!D36+1>365,Worksheet!K36>Worksheet!L36),\"Yes\",IF(Worksheet!D36>0,\"No\",\"\"))","v":""},{"$f":"IF(Worksheet!J36>0,Worksheet!K36/Worksheet!J36,0)","v":0},{"$f":"IF(AND(I30=\"Yes\",Worksheet!J36>0),Worksheet!M36/Worksheet!J36,0)","v":0},0,0,0,{"$f":"IF(AND(J30=\"Yes\",Worksheet!E36>0),(Worksheet!F36/Worksheet!E36)-Worksheet!H36,0)","v":0},0,0,0,null,null,null,"Blank"]
{"$rows_left_out":62}
{"sheet":"CPI","index":2,"n_rows":67,"n_cols":6,"rows_kept":67,"cut":false,"hidden":false,"merged":[[0,9,0,10],[1,9,1,10],[8,3,8,4],[5,5,6,5],[0,3,0,5],[1,3,1,5]]}
[null,null,null,"Consumer Price Index"]
[null,null,null,"For Calculating Capital Gains Using Indexation"]
[]
[]
[]
[null,null,null,"Indexation Method is Available \n",null,"1999-09-21"]
[null,null,null,"If Asset Was Acquired Before"]
[]
[null,null,null,"Quarter",null,"CPI"]
[null,null,null,"From","To","Factor"]
[null,null,null,"1985-07-01","1985-09-30",39.700000000000003]
[null,null,null,{"$f":"E11+1","v":"1985-10-01"},"1985-12-31",40.5]
[null,null,null,{"$f":"E12+1","v":"1986-01-01"},"1986-03-31",41.4]
[null,null,null,{"$f":"E13+1","v":"1986-04-01"},"1986-06-30",42.1]
[null,null,null,"1986-07-01","1986-09-30",43.2]
[null,null,null,"1986-10-01","1986-12-31",44.4]
[null,null,null,"1987-01-01","1987-03-31",45.3]
[null,null,null,"1987-04-01","1987-06-30",46]
[null,null,null,"1987-07-01","1987-09-30",46.8]
[null,null,null,"1987-10-01","1987-12-31",47.6]
[null,null,null,"1988-01-01","1988-03-31",48.4]
[null,null,null,"1988-04-01","1988-06-30",49.3]
[null,null,null,"1988-07-01","1988-09-30",50.2]
[null,null,null,"1988-10-01","1988-12-31",51.2]
[null,null,null,"1989-01-01","1989-03-31",51.7]
[null,null,null,"1989-04-01","1989-06-30",53]
[null,null,null,"1989-07-01","1989-09-30",54.2]
[null,null,null,"1989-10-01","1989-12-31",55.2]
[null,null,null,"1990-01-01","1990-03-31",56.2]
[null,null,null,"1990-04-01","1990-06-30",57.1]
{"$rows_left_out":37}